Can someone help me ?
[root@localhost edgeLinux-2.0.0]# ./install-local
Thanks for using the edgeLinux installer, we need some information to continue.
What is your email?: [email protected]
What is your full name?: Sandro Ferreira
What is your phone number? (optional): 5614549856
PLAY [all] *********************************************************************
TASK [Gathering Facts] *********************************************************
ok: [127.0.0.1]
TASK [Validate full name] ******************************************************
ok: [127.0.0.1] => {
"changed": false,
"msg": "All assertions passed"
}
TASK [Validate email] **********************************************************
ok: [127.0.0.1] => {
"changed": false,
"msg": "All assertions passed"
}
TASK [user-input : stat] *******************************************************
ok: [127.0.0.1]
TASK [user-input : Get devices] ************************************************
An exception occurred during task execution. To see the full traceback, use -vvv. The error was: AttributeError: 'NoneType' object has no attribute 'group'
fatal: [127.0.0.1]: FAILED! => {"changed": false, "module_stderr": "Traceback (most recent call last):\n File \"/root/.ansible/tmp/ansible-tmp-1581097939.95-85008144899862/AnsiballZ_antsle_devices.py\", line 102, in <module>\n _ansiballz_main()\n File \"/root/.ansible/tmp/ansible-tmp-1581097939.95-85008144899862/AnsiballZ_antsle_devices.py\", line 94, in _ansiballz_main\n invoke_module(zipped_mod, temp_path, ANSIBALLZ_PARAMS)\n File \"/root/.ansible/tmp/ansible-tmp-1581097939.95-85008144899862/AnsiballZ_antsle_devices.py\", line 40, in invoke_module\n runpy.run_module(mod_name='ansible.modules.antsle_devices', init_globals=None, run_name='__main__', alter_sys=True)\n File \"/usr/lib64/python2.7/runpy.py\", line 176, in run_module\n fname, loader, pkg_name)\n File \"/usr/lib64/python2.7/runpy.py\", line 82, in _run_module_code\n mod_name, mod_fname, mod_loader, pkg_name)\n File \"/usr/lib64/python2.7/runpy.py\", line 72, in _run_code\n exec code in run_globals\n File \"/tmp/ansible_antsle_devices_payload_soiSaE/ansible_antsle_devices_payload.zip/ansible/modules/antsle_devices.py\", line 198, in <module>\n File \"/tmp/ansible_antsle_devices_payload_soiSaE/ansible_antsle_devices_payload.zip/ansible/modules/antsle_devices.py\", line 113, in main\nAttributeError: 'NoneType' object has no attribute 'group'\n", "module_stdout": "", "msg": "MODULE FAILURE\nSee stdout/stderr for the exact error", "rc": 1}
PLAY RECAP *********************************************************************
127.0.0.1 : ok=4 changed=0 unreachable=0 failed=1 skipped=0 rescued=0 ignored=0
[root@localhost edgeLinux-2.0.0]#